Reaction Details
Target3-hydroxy-3-methylglutaryl-coenzyme A reductase
LigandBDBM50030652
Substrate/Competitorn/a
Meas. Tech.ChEMBL_1437082 (CHEMBL3390813)
IC50 25±n/a nM
Citation Mendieta, AJiménez, FGarduño-Siciliano, LMojica-Villegas, ARosales-Acosta, BVilla-Tanaca, LChamorro-Cevallos, GMedina-Franco, JLMeurice, NGutiérrez, RUMontiel, LECruz, Mdel CTamariz, J Synthesis and highly potent hypolipidemic activity of alpha-asarone- and fibrate-based 2-acyl and 2-alkyl phenols as HMG-CoA reductase inhibitors. Bioorg Med Chem22:5871-82 (2014) 
 
3-hydroxy-3-methylglutaryl-coenzyme A reductase
Name:3-hydroxy-3-methylglutaryl-coenzyme A reductase
Type:Enzyme
Mol. Mass.:97477.10
Organism:Homo sapiens (Human)
Description:P04035
Residue:888
BDBM50030652
NameBDBM50030652
Synonyms:CHEMBL3344536
TypeSmall organic molecule
Emp. Form.C11H14O4
Mol. Mass.210.2265
SMILESCCC(=O)c1cc(OC)c(OC)cc1O