Reaction Details
TargetMultidrug resistance-associated protein 1
LigandBDBM81939
Substrate/Competitorn/a
Meas. Tech.ChEMBL_1437088 (CHEMBL3390819)
EC50 27800±n/a nM
Citation Krauze, AGrinberga, SKrasnova, LAdlere, ISokolova, EDomracheva, IShestakova, IAndzans, ZDuburs, G Thieno[2,3-b]pyridines--a new class of multidrug resistance (MDR) modulators. Bioorg Med Chem22:5860-70 (2014) 
 
Multidrug resistance-associated protein 1
Name:Multidrug resistance-associated protein 1
Type:n/a
Mol. Mass.:171597.72
Organism:Homo sapiens (Human)
Description:P33527
Residue:1531
BDBM81939
NameBDBM81939
Synonyms:CAS_52-53-9 VERAPAMIL
TypeSmall organic molecule
Emp. Form.C27H38N2O4
Mol. Mass.454.6016
SMILESCOc1ccc(CCN(C)CCCC(C#N)(C(C)C)c2ccc(OC)c(OC)c2)cc1OC