Reaction Details
TargetBcl-2-like protein 1
LigandBDBM50030750
Substrate/Competitorn/a
Meas. Tech.ChEMBL_1437735 (CHEMBL3382382)
Ki 41±n/a nM
Citation Tao, ZFHasvold, LWang, LWang, XPetros, AMPark, CHBoghaert, ERCatron, NDChen, JColman, PMCzabotar, PEDeshayes, KFairbrother, WJFlygare, JAHymowitz, SGJin, SJudge, RAKoehler, MFKovar, PJLessene, GMitten, MJNdubaku, CONimmer, PPurkey, HEOleksijew, APhillips, DCSleebs, BESmith, BJSmith, MLTahir, SKWatson, KGXiao, YXue, JZhang, HZobel, KRosenberg, SHTse, CLeverson, JDElmore, SWSouers, AJ Discovery of a Potent and Selective BCL-XL Inhibitor with in Vivo Activity. ACS Med Chem Lett5:1088-93 (2014) 
 
Bcl-2-like protein 1
Name:Bcl-2-like protein 1
Type:Mitochondrion membrane; Single-pass membrane protein
Mol. Mass.:26039.60
Organism:Homo sapiens (Human)
Description:n/a
Residue:233
BDBM50030750
NameBDBM50030750
Synonyms:CHEMBL3342189
TypeSmall organic molecule
Emp. Form.C34H26N8O4S2
Mol. Mass.674.751
SMILESOC(=O)c1nc(sc1CCOc1cccc(c1)-n1ncc2cncnc12)N1CCc2cccc(C(=O)Nc3nc4ccccc4s3)c2C1