Reaction Details
TargetApoptosis regulator Bcl-2
LigandBDBM50030752
Substrate/Competitorn/a
Meas. Tech.ChEMBL_1437736 (CHEMBL3382383)
Ki 88±n/a nM
Citation Tao, ZFHasvold, LWang, LWang, XPetros, AMPark, CHBoghaert, ERCatron, NDChen, JColman, PMCzabotar, PEDeshayes, KFairbrother, WJFlygare, JAHymowitz, SGJin, SJudge, RAKoehler, MFKovar, PJLessene, GMitten, MJNdubaku, CONimmer, PPurkey, HEOleksijew, APhillips, DCSleebs, BESmith, BJSmith, MLTahir, SKWatson, KGXiao, YXue, JZhang, HZobel, KRosenberg, SHTse, CLeverson, JDElmore, SWSouers, AJ Discovery of a Potent and Selective BCL-XL Inhibitor with in Vivo Activity. ACS Med Chem Lett5:1088-93 (2014) 
 
Apoptosis regulator Bcl-2
Name:Apoptosis regulator Bcl-2
Type:Homodimer or heterodimer
Mol. Mass.:26269.11
Organism:Homo sapiens (Human)
Description:P10415
Residue:239
BDBM50030752
NameBDBM50030752
Synonyms:CHEMBL3342333
TypeSmall organic molecule
Emp. Form.C35H32FN5O4S2
Mol. Mass.669.788
SMILESCN(C)CC#Cc1ccc(OCCCc2sc(nc2C(O)=O)N2CCc3cccc(C(=O)Nc4nc5ccccc5s4)c3C2)cc1F