Reaction Details
TargetG-protein coupled receptor 39
LigandBDBM50030786
Substrate/Competitorn/a
Meas. Tech.ChEMBL_1438503 (CHEMBL3384907)
EC50 15±n/a nM
Citation Peukert, SHughes, RNunez, JHe, GYan, ZJain, RLlamas, LLuchansky, SCarlson, ALiang, GKunjathoor, VPietropaolo, MShapiro, JCastellana, AWu, XBose, A Discovery of 2-Pyridylpyrimidines as the First Orally Bioavailable GPR39 Agonists. ACS Med Chem Lett5:1114-8 (2014) 
 
G-protein coupled receptor 39
Name:G-protein coupled receptor 39
Type:PROTEIN
Mol. Mass.:51351.94
Organism:Homo sapiens (Human)
Description:ChEMBL_107977
Residue:453
BDBM50030786
NameBDBM50030786
Synonyms:CHEMBL3342367
TypeSmall organic molecule
Emp. Form.C17H16ClN5
Mol. Mass.325.795
SMILESCNc1nc(NCc2ccc(Cl)cc2)cc(n1)-c1ccccn1