Reaction Details
TargetGrowth hormone secretagogue receptor type 1
LigandBDBM50030788
Substrate/Competitorn/a
Meas. Tech.ChEMBL_1438516 (CHEMBL3385506)
IC50>30000±n/a nM
Citation Peukert, SHughes, RNunez, JHe, GYan, ZJain, RLlamas, LLuchansky, SCarlson, ALiang, GKunjathoor, VPietropaolo, MShapiro, JCastellana, AWu, XBose, A Discovery of 2-Pyridylpyrimidines as the First Orally Bioavailable GPR39 Agonists. ACS Med Chem Lett5:1114-8 (2014) 
 
Growth hormone secretagogue receptor type 1
Name:Growth hormone secretagogue receptor type 1
Type:Receptor
Mol. Mass.:41334.57
Organism:Homo sapiens (Human)
Description:Receptor binding studies use plasma membranes from LLC PK-1 cells transiently transfected with hGHSR1a.
Residue:366
BDBM50030788
NameBDBM50030788
Synonyms:CHEMBL3342358
TypeSmall organic molecule
Emp. Form.C18H19ClN6O2S
Mol. Mass.418.9
SMILESCNc1nc(NCc2ccc(NS(C)(=O)=O)cc2Cl)cc(n1)-c1ccccn1