Reaction Details
TargetType-2 angiotensin II receptor
LigandBDBM50009338
Substrate/Competitorn/a
Meas. Tech.ChEMBL_1438528 (CHEMBL3385518)
Ki 0.380000±n/a nM
Citation Guimond, MOHallberg, MGallo-Payet, NWallinder, C Saralasin and Sarile Are AT2 Receptor Agonists. ACS Med Chem Lett5:1129-32 (2014) 
 
Type-2 angiotensin II receptor
Name:Type-2 angiotensin II receptor
Type:Enzyme Catalytic Domain
Mol. Mass.:41201.61
Organism:Homo sapiens (Human)
Description:Angiotensin II, central 0 0::P50052
Residue:363
BDBM50009338
NameBDBM50009338
Synonyms:(S)-2-((S)-1-((S)-2-((S)-2-((S)-2-((S)-2-((S)-5-(diaminomethyleneamino)-2-(2-(methylamino)acetamido)pentanamido)-3-methylbutanamido)-3-(4-hydroxyphenyl)propanamido)-3-methylbutanamido)-3-(1H-imidazol-5-yl)propanoyl)pyrrolidine-5-carboxamido)propanoic acid SARALASIN Sar-Arg-Val-Tyr-Val-His-Pro-Ala (sarlasin) | [Sar1-Arg2-Val3-Tyr4-Val5-His6-Pro7-Ala8]
TypeSmall organic molecule
Emp. Form.C42H65N13O10
Mol. Mass.912.0466
SMILESCNCC(=O)N[C@@H](CCCN=C(N)N)C(=O)N[C@@H](C(C)C)C(=O)N[C@@H](Cc1ccc(O)cc1)C(=O)N[C@@H](C(C)C)C(=O)N[C@@H](Cc1cnc[nH]1)C(=O)N1CCC[C@H]1C(=O)N[C@@H](C)C(O)=O