Reaction Details
TargetTyrosine-protein kinase Lck
LigandBDBM50030881
Substrate/Competitorn/a
Meas. Tech.ChEMBL_1441603 (CHEMBL3376483)
IC50>30000±n/a nM
Citation Deng, YShipps, GWCooper, AEnglish, JMAnnis, DACarr, DNan, YWang, TZhu, HYChuang, CCDayananth, PHruza, AWXiao, LJin, WKirschmeier, PWindsor, WTSamatar, AA Discovery of novel, dual mechanism ERK inhibitors by affinity selection screening of an inactive kinase. J Med Chem57:8817-26 (2014) 
 
Tyrosine-protein kinase Lck
Name:Tyrosine-protein kinase Lck
Type:n/a
Mol. Mass.:57987.83
Organism:Homo sapiens (Human)
Description:P06239
Residue:509
BDBM50030881
NameBDBM50030881
Synonyms:CHEMBL3356117
TypeSmall organic molecule
Emp. Form.C25H29ClN4O4
Mol. Mass.484.975
SMILESCC(=O)c1ccc(cc1)N1CCN(CC1)C(=O)CN1CC[C@H](C1)C(=O)Nc1ccc(O)c(Cl)c1