Reaction Details
TargetVascular endothelial growth factor receptor 1
LigandBDBM50030881
Substrate/Competitorn/a
Meas. Tech.ChEMBL_1441614 (CHEMBL3377060)
IC50>50000±n/a nM
Citation Deng, YShipps, GWCooper, AEnglish, JMAnnis, DACarr, DNan, YWang, TZhu, HYChuang, CCDayananth, PHruza, AWXiao, LJin, WKirschmeier, PWindsor, WTSamatar, AA Discovery of novel, dual mechanism ERK inhibitors by affinity selection screening of an inactive kinase. J Med Chem57:8817-26 (2014) 
 
Vascular endothelial growth factor receptor 1
Name:Vascular endothelial growth factor receptor 1
Type:Receptor Tyrosine Kinase
Mol. Mass.:150800.23
Organism:Homo sapiens (Human)
Description:P17948
Residue:1338
BDBM50030881
NameBDBM50030881
Synonyms:CHEMBL3356117
TypeSmall organic molecule
Emp. Form.C25H29ClN4O4
Mol. Mass.484.975
SMILESCC(=O)c1ccc(cc1)N1CCN(CC1)C(=O)CN1CC[C@H](C1)C(=O)Nc1ccc(O)c(Cl)c1