Reaction Details
TargetMitogen-activated protein kinase 1
LigandBDBM50030891
Substrate/Competitorn/a
Meas. Tech.ChEMBL_1441587 (CHEMBL3376467)
IC50 2500±n/a nM
Citation Deng, YShipps, GWCooper, AEnglish, JMAnnis, DACarr, DNan, YWang, TZhu, HYChuang, CCDayananth, PHruza, AWXiao, LJin, WKirschmeier, PWindsor, WTSamatar, AA Discovery of novel, dual mechanism ERK inhibitors by affinity selection screening of an inactive kinase. J Med Chem57:8817-26 (2014) 
 
Mitogen-activated protein kinase 1
Name:Mitogen-activated protein kinase 1
Type:Ser/Thr Protein Kinase
Mol. Mass.:41392.76
Organism:Homo sapiens (Human)
Description:P28482
Residue:360
BDBM50030891
NameBDBM50030891
Synonyms:CHEMBL3356129
TypeSmall organic molecule
Emp. Form.C26H32N4O4
Mol. Mass.464.5567
SMILESCC(=O)c1ccc(cc1)N1CCN(CC1)C(=O)CN1CC[C@H](C1)C(=O)Nc1ccc(O)c(C)c1