Reaction Details
TargetMitogen-activated protein kinase 1
LigandBDBM50030884
Substrate/Competitorn/a
Meas. Tech.ChEMBL_1441589 (CHEMBL3376469)
IC50 1650±n/a nM
Citation Deng, YShipps, GWCooper, AEnglish, JMAnnis, DACarr, DNan, YWang, TZhu, HYChuang, CCDayananth, PHruza, AWXiao, LJin, WKirschmeier, PWindsor, WTSamatar, AA Discovery of novel, dual mechanism ERK inhibitors by affinity selection screening of an inactive kinase. J Med Chem57:8817-26 (2014) 
 
Mitogen-activated protein kinase 1
Name:Mitogen-activated protein kinase 1
Type:Ser/Thr Protein Kinase
Mol. Mass.:41392.76
Organism:Homo sapiens (Human)
Description:P28482
Residue:360
BDBM50030884
NameBDBM50030884
Synonyms:CHEMBL3356116
TypeSmall organic molecule
Emp. Form.C23H27ClN4O3
Mol. Mass.442.938
SMILESOc1ccc(NC(=O)C2CCN(CC(=O)N3CCN(CC3)c3cccc(Cl)c3)C2)cc1