Reaction Details
TargetTransthyretin
LigandBDBM50133496
Substrate/Competitorn/a
Meas. Tech.ChEMBL_1441631 (CHEMBL3377077)
EC50 8600±n/a nM
Citation Yokoyama, TKosaka, YMizuguchi, M Inhibitory activities of propolis and its promising component, caffeic acid phenethyl ester, against amyloidogenesis of human transthyretin. J Med Chem57:8928-35 (2014) 
 
Transthyretin
Name:Transthyretin
Type:Enzyme
Mol. Mass.:15884.31
Organism:Homo sapiens (Human)
Description:P02766
Residue:147
BDBM50133496
NameBDBM50133496
Synonyms:(2R)-3-(3,4-dihydroxyphenyl)-2-[(2E)-3-(3,4-dihydroxyphenyl)prop-2-enoyloxy]propanoic acid CHEMBL324842 US10688093, Compound rosmarinic acid cid_5281792
TypeSmall organic molecule
Emp. Form.C18H16O8
Mol. Mass.360.3148
SMILESOC(=O)[C@@H](Cc1ccc(O)c(O)c1)OC(=O)\C=C\c1ccc(O)c(O)c1