Reaction Details
TargetBromodomain-containing protein 4
LigandBDBM50030919
Substrate/Competitorn/a
Meas. Tech.ChEMBL_1442439 (CHEMBL3380069)
IC50 2760±n/a nM
Citation McKeown, MRShaw, DLFu, HLiu, SXu, XMarineau, JJHuang, YZhang, XBuckley, DLKadam, AZhang, ZBlacklow, SCQi, JZhang, WBradner, JE Biased multicomponent reactions to develop novel bromodomain inhibitors. J Med Chem57:9019-27 (2014) 
 
Bromodomain-containing protein 4
Name:Bromodomain-containing protein 4
Type:Protein
Mol. Mass.:152264.84
Organism:Homo sapiens (Human)
Description:O60885
Residue:1362
BDBM50030919
NameBDBM50030919
Synonyms:CHEMBL3356548
TypeSmall organic molecule
Emp. Form.C25H22N4O2
Mol. Mass.410.4678
SMILESCOc1ccc(Nc2c(nc3ccccn23)-c2ccc(cc2)-c2c(C)noc2C)cc1