Reaction Details
TargetBromodomain-containing protein 4
LigandBDBM50030922
Substrate/Competitorn/a
Meas. Tech.ChEMBL_1442439 (CHEMBL3380069)
IC50 11800±n/a nM
Citation McKeown, MRShaw, DLFu, HLiu, SXu, XMarineau, JJHuang, YZhang, XBuckley, DLKadam, AZhang, ZBlacklow, SCQi, JZhang, WBradner, JE Biased multicomponent reactions to develop novel bromodomain inhibitors. J Med Chem57:9019-27 (2014) 
 
Bromodomain-containing protein 4
Name:Bromodomain-containing protein 4
Type:Protein
Mol. Mass.:152264.84
Organism:Homo sapiens (Human)
Description:O60885
Residue:1362
BDBM50030922
NameBDBM50030922
Synonyms:CHEMBL3356545
TypeSmall organic molecule
Emp. Form.C25H21ClN4O
Mol. Mass.428.913
SMILESCc1noc(C)c1-c1ccc(cc1)-c1nc2ccc(Cl)cn2c1NCc1ccccc1