Reaction Details
TargetBromodomain-containing protein 4
LigandBDBM50030927
Substrate/Competitorn/a
Meas. Tech.ChEMBL_1442439 (CHEMBL3380069)
IC50 13000±n/a nM
Citation McKeown, MRShaw, DLFu, HLiu, SXu, XMarineau, JJHuang, YZhang, XBuckley, DLKadam, AZhang, ZBlacklow, SCQi, JZhang, WBradner, JE Biased multicomponent reactions to develop novel bromodomain inhibitors. J Med Chem57:9019-27 (2014) 
 
Bromodomain-containing protein 4
Name:Bromodomain-containing protein 4
Type:Protein
Mol. Mass.:152264.84
Organism:Homo sapiens (Human)
Description:O60885
Residue:1362
BDBM50030927
NameBDBM50030927
Synonyms:CHEMBL3356137
TypeSmall organic molecule
Emp. Form.C25H27N3O4
Mol. Mass.433.4996
SMILESCCCCN1C(c2ccc(-c3c(C)noc3C)c(OC)c2)C(=O)Nc2ccccc2C1=O