Reaction Details
TargetBromodomain-containing protein 4
LigandBDBM50030932
Substrate/Competitorn/a
Meas. Tech.ChEMBL_1442439 (CHEMBL3380069)
IC50 1700±n/a nM
Citation McKeown, MRShaw, DLFu, HLiu, SXu, XMarineau, JJHuang, YZhang, XBuckley, DLKadam, AZhang, ZBlacklow, SCQi, JZhang, WBradner, JE Biased multicomponent reactions to develop novel bromodomain inhibitors. J Med Chem57:9019-27 (2014) 
 
Bromodomain-containing protein 4
Name:Bromodomain-containing protein 4
Type:Protein
Mol. Mass.:152264.84
Organism:Homo sapiens (Human)
Description:O60885
Residue:1362
BDBM50030932
NameBDBM50030932
Synonyms:CHEMBL3356132
TypeSmall organic molecule
Emp. Form.C12H11NO2
Mol. Mass.201.2212
SMILESCc1noc(C)c1-c1ccc(C=O)cc1