Reaction Details
TargetSodium-dependent neutral amino acid transporter B(0)AT2
LigandBDBM22876
Substrate/Competitorn/a
Meas. Tech.ChEMBL_1432515 (CHEMBL3386947)
IC50 4000±n/a nM
Citation Cuboni, SDevigny, CHoogeland, BStrasser, APomplun, SHauger, BHöfner, GWanner, KTEder, MBuschauer, AHolsboer, FHausch, F Loratadine and analogues: discovery and preliminary structure-activity relationship of inhibitors of the amino acid transporter B(0)AT2. J Med Chem57:9473-9 (2014) 
 
Sodium-dependent neutral amino acid transporter B(0)AT2
Name:Sodium-dependent neutral amino acid transporter B(0)AT2
Type:PROTEIN
Mol. Mass.:81820.70
Organism:Homo sapiens (Human)
Description:ChEMBL_109513
Residue:730
BDBM22876
NameBDBM22876
Synonyms:CHEMBL998 Loratadine US9138431, LORATADINE (Claritin) ethyl 4-{13-chloro-4-azatricyclo[9.4.0.0^{3,8}]pentadeca-1(11),3(8),4,6,12,14-hexaen-2-ylidene}piperidine-1-carboxylate
TypeSmall organic molecule
Emp. Form.C22H23ClN2O2
Mol. Mass.382.883
SMILES[#6]-[#6]-[#8]-[#6](=O)-[#7]-1-[#6]-[#6]\[#6](-[#6]-[#6]-1)=[#6]-1\c2ccc(Cl)cc2-[#6]-[#6]-c2cccnc-12