Reaction Details
TargetMetabotropic glutamate receptor 4
LigandBDBM50293720
Substrate/Competitorn/a
Meas. Tech.ChEMBL_1434272 (CHEMBL3385817)
IC50 10.0±n/a nM
Citation Kil, KEPoutiainen, PZhang, ZZhu, AChoi, JKJokivarsi, KBrownell, AL Radiosynthesis and evaluation of an 18F-labeled positron emission tomography (PET) radioligand for metabotropic glutamate receptor subtype 4 (mGlu4). J Med Chem57:9130-8 (2014) 
 
Metabotropic glutamate receptor 4
Name:Metabotropic glutamate receptor 4
Type:Enzyme
Mol. Mass.:101849.79
Organism:Rattus norvegicus (Rat)
Description:P31423
Residue:912
BDBM50293720
NameBDBM50293720
Synonyms:CHEMBL541754 cid_44189740
TypeSmall organic molecule
Emp. Form.C13H10F2N2O2
Mol. Mass.264.2275
SMILESFC(F)Oc1cccc(NC(=O)c2ccccn2)c1