Reaction Details
TargetMetabotropic glutamate receptor 4
LigandBDBM50293721
Substrate/Competitorn/a
Meas. Tech.ChEMBL_1434272 (CHEMBL3385817)
IC50 13±n/a nM
Citation Kil, KEPoutiainen, PZhang, ZZhu, AChoi, JKJokivarsi, KBrownell, AL Radiosynthesis and evaluation of an 18F-labeled positron emission tomography (PET) radioligand for metabotropic glutamate receptor subtype 4 (mGlu4). J Med Chem57:9130-8 (2014) 
 
Metabotropic glutamate receptor 4
Name:Metabotropic glutamate receptor 4
Type:Enzyme
Mol. Mass.:101849.79
Organism:Rattus norvegicus (Rat)
Description:P31423
Residue:912
BDBM50293721
NameBDBM50293721
Synonyms:CHEMBL562551 cid_44191096
TypeSmall organic molecule
Emp. Form.C13H11ClN2O2
Mol. Mass.262.692
SMILESCOc1cc(NC(=O)c2ccccn2)ccc1Cl