Reaction Details
TargetCytochrome P450 2B6
LigandBDBM50265079
Substrate/Competitorn/a
Meas. Tech.ChEMBL_1435701 (CHEMBL3388334)
IC50>2500±n/a nM
Citation Spicer, TPJiang, JTaylor, ABChoi, JYHart, PJRoush, WRFields, GBHodder, PSMinond, D Characterization of selective exosite-binding inhibitors of matrix metalloproteinase 13 that prevent articular cartilage degradation in vitro. J Med Chem57:9598-611 (2014) 
 
Cytochrome P450 2B6
Name:Cytochrome P450 2B6
Type:Protein
Mol. Mass.:56289.75
Organism:Homo sapiens (Human)
Description:P20813
Residue:491
BDBM50265079
NameBDBM50265079
Synonyms:(4-[1-methyl-2,4-dioxo-6-(3-phenyl-prop-1-ynyl)-1,4-dihydro-2H-quinazolin-3-ylmethyl]-benzoic acid) 4-{[1-METHYL-2,4-DIOXO-6-(3-PHENYLPROP-1-YN-1-YL)-1,4-DIHYDROQUINAZOLIN-3(2H)-YL]METHYL}BENZOIC ACID MMP Inhibitor, 5
TypeSmall organic molecule
Emp. Form.C26H20N2O4
Mol. Mass.424.448
SMILESCn1c2ccc(cc2c(=O)n(Cc2ccc(cc2)C(O)=O)c1=O)C#CCc1ccccc1