Reaction Details
TargetCytochrome P450 2C9
LigandBDBM16596
Substrate/Competitorn/a
Meas. Tech.ChEMBL_1435703 (CHEMBL3388336)
IC50>20000±n/a nM
Citation Spicer, TPJiang, JTaylor, ABChoi, JYHart, PJRoush, WRFields, GBHodder, PSMinond, D Characterization of selective exosite-binding inhibitors of matrix metalloproteinase 13 that prevent articular cartilage degradation in vitro. J Med Chem57:9598-611 (2014) 
 
Cytochrome P450 2C9
Name:Cytochrome P450 2C9
Type:Enzyme
Mol. Mass.:55636.33
Organism:Homo sapiens (Human)
Description:P11712
Residue:490
BDBM16596
NameBDBM16596
Synonyms:4-N,6-N-bis[(4-fluoro-3-methylphenyl)methyl]pyrimidine-4,6-dicarboxamide MMP Inhibitor, 4 Pyrimidine Dicarboxamide Inhibitor, 4
TypeSmall organic molecule
Emp. Form.C22H20F2N4O2
Mol. Mass.410.4166
SMILESCc1cc(CNC(=O)c2cc(ncn2)C(=O)NCc2ccc(F)c(C)c2)ccc1F