Reaction Details
TargetDNA (cytosine-5)-methyltransferase 3A
LigandBDBM50031317
Substrate/Competitorn/a
Meas. Tech.ChEMBL_1436391 (CHEMBL3389594)
IC50>200000±n/a nM
Citation Chen, SWang, YZhou, WLi, SPeng, JShi, ZHu, JLiu, YCDing, HLin, YLi, LCheng, SLiu, JLu, TJiang, HLiu, BZheng, MLuo, C Identifying novel selective non-nucleoside DNA methyltransferase 1 inhibitors through docking-based virtual screening. J Med Chem57:9028-41 (2014) 
 
DNA (cytosine-5)-methyltransferase 3A
Name:DNA (cytosine-5)-methyltransferase 3A
Type:PROTEIN
Mol. Mass.:101857.24
Organism:Homo sapiens (Human)
Description:ChEMBL_1510405
Residue:912
BDBM50031317
NameBDBM50031317
Synonyms:CHEMBL3358015
TypeSmall organic molecule
Emp. Form.C25H25N3O
Mol. Mass.383.4855
SMILESOC(CNCCc1c[nH]c2ccccc12)Cn1c2ccccc2c2ccccc12