Reaction Details
TargetDNA (cytosine-5)-methyltransferase 1
LigandBDBM50031328
Substrate/Competitorn/a
Meas. Tech.ChEMBL_1436389 (CHEMBL3389592)
IC50 20700±n/a nM
Citation Chen, SWang, YZhou, WLi, SPeng, JShi, ZHu, JLiu, YCDing, HLin, YLi, LCheng, SLiu, JLu, TJiang, HLiu, BZheng, MLuo, C Identifying novel selective non-nucleoside DNA methyltransferase 1 inhibitors through docking-based virtual screening. J Med Chem57:9028-41 (2014) 
 
DNA (cytosine-5)-methyltransferase 1
Name:DNA (cytosine-5)-methyltransferase 1
Type:PROTEIN
Mol. Mass.:183211.58
Organism:Mus musculus
Description:ChEMBL_109519
Residue:1620
BDBM50031328
NameBDBM50031328
Synonyms:CHEMBL3358020
TypeSmall organic molecule
Emp. Form.C23H24N2O
Mol. Mass.344.4495
SMILESOC(CNCCc1ccccc1)Cn1c2ccccc2c2ccccc12