Reaction Details
TargetDNA (cytosine-5)-methyltransferase 1
LigandBDBM50031329
Substrate/Competitorn/a
Meas. Tech.ChEMBL_1436389 (CHEMBL3389592)
IC50 15600±n/a nM
Citation Chen, SWang, YZhou, WLi, SPeng, JShi, ZHu, JLiu, YCDing, HLin, YLi, LCheng, SLiu, JLu, TJiang, HLiu, BZheng, MLuo, C Identifying novel selective non-nucleoside DNA methyltransferase 1 inhibitors through docking-based virtual screening. J Med Chem57:9028-41 (2014) 
 
DNA (cytosine-5)-methyltransferase 1
Name:DNA (cytosine-5)-methyltransferase 1
Type:PROTEIN
Mol. Mass.:183211.58
Organism:Mus musculus
Description:ChEMBL_109519
Residue:1620
BDBM50031329
NameBDBM50031329
Synonyms:CHEMBL3358017
TypeSmall organic molecule
Emp. Form.C25H25N3O
Mol. Mass.383.4855
SMILESO[C@@H](CNCCc1c[nH]c2ccccc12)Cn1c2ccccc2c2ccccc12