Reaction Details
TargetDeoxycytidine kinase
LigandBDBM50031338
Substrate/Competitorn/a
Meas. Tech.ChEMBL_1437135 (CHEMBL3381704)
IC50 605±n/a nM
Citation Nomme, JLi, ZGipson, RMWang, JArmijo, ALLe, TPoddar, SSmith, TSantarsiero, BDNguyen, HACzernin, JAlexandrova, ANJung, MERadu, CGLavie, A Structure-guided development of deoxycytidine kinase inhibitors with nanomolar affinity and improved metabolic stability. J Med Chem57:9480-94 (2014) 
 
Deoxycytidine kinase
Name:Deoxycytidine kinase
Type:PROTEIN
Mol. Mass.:30510.65
Organism:Homo sapiens (Human)
Description:ChEMBL_1437135
Residue:260
BDBM50031338
NameBDBM50031338
Synonyms:CHEMBL3358090
TypeSmall organic molecule
Emp. Form.C20H26N6O4S3
Mol. Mass.510.653
SMILESCOc1ccc(cc1OCCNS(C)(=O)=O)-c1nc([C@H](C)Sc2nc(N)cc(N)n2)c(C)s1