Reaction Details
TargetDeoxycytidine kinase
LigandBDBM50440179
Substrate/Competitorn/a
Meas. Tech.ChEMBL_1437136 (CHEMBL3381705)
Ki 2.0±n/a nM
Citation Nomme, JLi, ZGipson, RMWang, JArmijo, ALLe, TPoddar, SSmith, TSantarsiero, BDNguyen, HACzernin, JAlexandrova, ANJung, MERadu, CGLavie, A Structure-guided development of deoxycytidine kinase inhibitors with nanomolar affinity and improved metabolic stability. J Med Chem57:9480-94 (2014) 
 
Deoxycytidine kinase
Name:Deoxycytidine kinase
Type:PROTEIN
Mol. Mass.:30510.65
Organism:Homo sapiens (Human)
Description:ChEMBL_1437135
Residue:260
BDBM50440179
NameBDBM50440179
Synonyms:CHEMBL2426567
TypeSmall organic molecule
Emp. Form.C21H27N5O4S2
Mol. Mass.477.6
SMILESCCCc1sc(nc1CSc1nc(N)cc(N)n1)-c1ccc(OCCO)c(OCCO)c1