Reaction Details
TargetDeoxycytidine kinase
LigandBDBM50031351
Substrate/Competitorn/a
Meas. Tech.ChEMBL_1437137 (CHEMBL3381706)
IC50 395±n/a nM
Citation Nomme, JLi, ZGipson, RMWang, JArmijo, ALLe, TPoddar, SSmith, TSantarsiero, BDNguyen, HACzernin, JAlexandrova, ANJung, MERadu, CGLavie, A Structure-guided development of deoxycytidine kinase inhibitors with nanomolar affinity and improved metabolic stability. J Med Chem57:9480-94 (2014) 
 
Deoxycytidine kinase
Name:Deoxycytidine kinase
Type:PROTEIN
Mol. Mass.:30510.65
Organism:Homo sapiens (Human)
Description:ChEMBL_1437135
Residue:260
BDBM50031351
NameBDBM50031351
Synonyms:CHEMBL3358092
TypeSmall organic molecule
Emp. Form.C22H29N5O3S2
Mol. Mass.475.627
SMILESCCCc1sc(nc1CSc1cc(N)nc(N)n1)-c1ccc(OC)c(OCC(C)(C)O)c1