Reaction Details
TargetD(3) dopamine receptor
LigandBDBM50001885
Substrate/Competitorn/a
Meas. Tech.ChEMBL_1437145 (CHEMBL3381714)
Ki 6.7±n/a nM
Citation Brindisi, MButini, SFranceschini, SBrogi, STrotta, FRos, SCagnotto, ASalmona, MCasagni, AAndreassi, MSaponara, SGorelli, BWeikop, PMikkelsen, JDScheel-Kruger, JSandager-Nielsen, KNovellino, ECampiani, GGemma, S Targeting dopamine D3 and serotonin 5-HT1A and 5-HT2A receptors for developing effective antipsychotics: synthesis, biological characterization, and behavioral studies. J Med Chem57:9578-97 (2014) 
 
D(3) dopamine receptor
Name:D(3) dopamine receptor
Type:n/a
Mol. Mass.:44243.43
Organism:Homo sapiens (Human)
Description:n/a
Residue:400
BDBM50001885
NameBDBM50001885
Synonyms:(risperidone)3-{2-[4-(6-Fluoro-benzo[d]isoxazol-3-yl)-piperidin-1-yl]-ethyl}-2-methyl-6,7,8,9-tetrahydro-pyrido[1,2-a]pyrimidin-4-one 2-(2-(4-(benzo[d]isoxazol-3-yl)piperidin-1-yl)ethyl)-7,8,9,9a-tetrahydro-1H-pyrido[1,2-a]pyrimidin-4(6H)-one 3-(2-(4-(6-fluorobenzo[d]isoxazol-3-yl)piperidin-1-yl)ethyl)-2-methyl-6,7,8,9-tetrahydropyrido[1,2-a]pyrimidin-4-one 3-{2-[4-(6-Fluoro-benzo[d]isoxazol-3-yl)-piperidin-1-yl]-ethyl}-2-methyl-6,7,8,9-tetrahydro-pyrido[1,2-a]pyrimidin-4-one (Resperidone) 3-{2-[4-(6-Fluoro-benzo[d]isoxazol-3-yl)-piperidin-1-yl]-ethyl}-2-methyl-6,7,8,9-tetrahydro-pyrido[1,2-a]pyrimidin-4-one(risperidone) CHEMBL85 RISPERDAL US10167256, Risperidone US10259786, Risperidone US8802672, Risperidone | WO2023288027, Cmpd Risperidone
TypeSmall organic molecule
Emp. Form.C23H27FN4O2
Mol. Mass.410.4845
SMILESCc1nc2CCCCn2c(=O)c1CCN1CCC(CC1)c1noc2cc(F)ccc12