Reaction Details
Target5-hydroxytryptamine receptor 1A
LigandBDBM50031465
Substrate/Competitorn/a
Meas. Tech.ChEMBL_1437146 (CHEMBL3381715)
Ki 1.9±n/a nM
Citation Brindisi, MButini, SFranceschini, SBrogi, STrotta, FRos, SCagnotto, ASalmona, MCasagni, AAndreassi, MSaponara, SGorelli, BWeikop, PMikkelsen, JDScheel-Kruger, JSandager-Nielsen, KNovellino, ECampiani, GGemma, S Targeting dopamine D3 and serotonin 5-HT1A and 5-HT2A receptors for developing effective antipsychotics: synthesis, biological characterization, and behavioral studies. J Med Chem57:9578-97 (2014) 
 
5-hydroxytryptamine receptor 1A
Name:5-hydroxytryptamine receptor 1A
Type:n/a
Mol. Mass.:46122.49
Organism:Homo sapiens (Human)
Description:n/a
Residue:422
BDBM50031465
NameBDBM50031465
Synonyms:CHEMBL3358104
TypeSmall organic molecule
Emp. Form.C24H27F3N4O
Mol. Mass.444.4926
SMILESFC(F)(F)c1cccc(c1)N1CCN(CCCCNC(=O)c2cc3ccccc3[nH]2)CC1