Reaction Details
Target5-hydroxytryptamine receptor 2A
LigandBDBM50031449
Substrate/Competitorn/a
Meas. Tech.ChEMBL_1437147 (CHEMBL3381716)
Ki 3.6±n/a nM
Citation Brindisi, MButini, SFranceschini, SBrogi, STrotta, FRos, SCagnotto, ASalmona, MCasagni, AAndreassi, MSaponara, SGorelli, BWeikop, PMikkelsen, JDScheel-Kruger, JSandager-Nielsen, KNovellino, ECampiani, GGemma, S Targeting dopamine D3 and serotonin 5-HT1A and 5-HT2A receptors for developing effective antipsychotics: synthesis, biological characterization, and behavioral studies. J Med Chem57:9578-97 (2014) 
 
5-hydroxytryptamine receptor 2A
Name:5-hydroxytryptamine receptor 2A
Type:undefined
Mol. Mass.:52607.65
Organism:Homo sapiens (Human)
Description:P28223
Residue:471
BDBM50031449
NameBDBM50031449
Synonyms:CHEMBL3358493
TypeSmall organic molecule
Emp. Form.C25H31N3O2
Mol. Mass.405.5325
SMILESCc1cccc(N2CCN(CCCCNC(=O)c3cc4ccccc4o3)CC2)c1C