Reaction Details
Target5-hydroxytryptamine receptor 2C
LigandBDBM50031354
Substrate/Competitorn/a
Meas. Tech.ChEMBL_1437148 (CHEMBL3381717)
Ki 169±n/a nM
Citation Brindisi, MButini, SFranceschini, SBrogi, STrotta, FRos, SCagnotto, ASalmona, MCasagni, AAndreassi, MSaponara, SGorelli, BWeikop, PMikkelsen, JDScheel-Kruger, JSandager-Nielsen, KNovellino, ECampiani, GGemma, S Targeting dopamine D3 and serotonin 5-HT1A and 5-HT2A receptors for developing effective antipsychotics: synthesis, biological characterization, and behavioral studies. J Med Chem57:9578-97 (2014) 
 
5-hydroxytryptamine receptor 2C
Name:5-hydroxytryptamine receptor 2C
Type:G Protein-Coupled Receptor (GPCR)
Mol. Mass.:51836.79
Organism:Homo sapiens (Human)
Description:P28335
Residue:458
BDBM50031354
NameBDBM50031354
Synonyms:CHEMBL3358100
TypeSmall organic molecule
Emp. Form.C25H30N4O
Mol. Mass.402.5319
SMILESCc1cccc(c1)N1CCN(CCCCNC(=O)c2cc3ccccc3cn2)CC1