Reaction Details
Target5-hydroxytryptamine receptor 2C
LigandBDBM50031369
Substrate/Competitorn/a
Meas. Tech.ChEMBL_1437148 (CHEMBL3381717)
Ki>1000±n/a nM
Citation Brindisi, MButini, SFranceschini, SBrogi, STrotta, FRos, SCagnotto, ASalmona, MCasagni, AAndreassi, MSaponara, SGorelli, BWeikop, PMikkelsen, JDScheel-Kruger, JSandager-Nielsen, KNovellino, ECampiani, GGemma, S Targeting dopamine D3 and serotonin 5-HT1A and 5-HT2A receptors for developing effective antipsychotics: synthesis, biological characterization, and behavioral studies. J Med Chem57:9578-97 (2014) 
 
5-hydroxytryptamine receptor 2C
Name:5-hydroxytryptamine receptor 2C
Type:G Protein-Coupled Receptor (GPCR)
Mol. Mass.:51836.79
Organism:Homo sapiens (Human)
Description:P28335
Residue:458
BDBM50031369
NameBDBM50031369
Synonyms:CHEMBL3358505
TypeSmall organic molecule
Emp. Form.C24H32N4O
Mol. Mass.392.5371
SMILESO=C(NCCCCN1CCN(CC1)c1ccccc1)[C@H]1CCc2ccccc2N1