Reaction Details
TargetD(2) dopamine receptor
LigandBDBM50031468
Substrate/Competitorn/a
Meas. Tech.ChEMBL_1437144 (CHEMBL3381713)
Ki 219±n/a nM
Citation Brindisi, MButini, SFranceschini, SBrogi, STrotta, FRos, SCagnotto, ASalmona, MCasagni, AAndreassi, MSaponara, SGorelli, BWeikop, PMikkelsen, JDScheel-Kruger, JSandager-Nielsen, KNovellino, ECampiani, GGemma, S Targeting dopamine D3 and serotonin 5-HT1A and 5-HT2A receptors for developing effective antipsychotics: synthesis, biological characterization, and behavioral studies. J Med Chem57:9578-97 (2014) 
 
D(2) dopamine receptor
Name:D(2) dopamine receptor
Type:Cell-surface receptors
Mol. Mass.:50647.10
Organism:Homo sapiens (Human)
Description:P14416
Residue:443
BDBM50031468
NameBDBM50031468
Synonyms:CHEMBL3358102
TypeSmall organic molecule
Emp. Form.C25H32N4O2
Mol. Mass.420.5472
SMILESCOc1cccc(c1)N1CCN(CCCCNC(=O)c2cc3ccccc3n2C)CC1