Reaction Details
TargetMelanocortin receptor 5
LigandBDBM50031479
Substrate/Competitorn/a
Meas. Tech.ChEMBL_1438568 (CHEMBL3386099)
EC50 0.042000±n/a nM
Citation Testa, CScrima, MGrimaldi, MD'Ursi, AMDirain, MLLubin-Germain, NSingh, AHaskell-Luevano, CChorev, MRovero, PPapini, AM 1,4-disubstituted-[1,2,3]triazolyl-containing analogues of MT-II: design, synthesis, conformational analysis, and biological activity. J Med Chem57:9424-34 (2014) 
 
Melanocortin receptor 5
Name:Melanocortin receptor 5
Type:Enzyme
Mol. Mass.:36966.58
Organism:Mus musculus (Mouse)
Description:P41149
Residue:325
BDBM50031479
NameBDBM50031479
Synonyms:CHEMBL3358545
TypeSmall organic molecule
Emp. Form.C51H69N17O8
Mol. Mass.1048.2027
SMILESCCCC[C@H](NC(C)=O)C(=O)N[C@H]1CCCc2cn(CC[C@H](NC(=O)[C@H](Cc3c[nH]c4ccccc34)NC(=O)[C@H](CCCNC(N)=N)NC(=O)[C@@H](Cc3ccccc3)NC(=O)[C@H](Cc3cnc[nH]3)NC1=O)C(N)=O)nn2