Reaction Details
TargetMelanocortin receptor 5
LigandBDBM50031488
Substrate/Competitorn/a
Meas. Tech.ChEMBL_1438568 (CHEMBL3386099)
EC50 0.051000±n/a nM
Citation Testa, CScrima, MGrimaldi, MD'Ursi, AMDirain, MLLubin-Germain, NSingh, AHaskell-Luevano, CChorev, MRovero, PPapini, AM 1,4-disubstituted-[1,2,3]triazolyl-containing analogues of MT-II: design, synthesis, conformational analysis, and biological activity. J Med Chem57:9424-34 (2014) 
 
Melanocortin receptor 5
Name:Melanocortin receptor 5
Type:Enzyme
Mol. Mass.:36966.58
Organism:Mus musculus (Mouse)
Description:P41149
Residue:325
BDBM50031488
NameBDBM50031488
Synonyms:CHEMBL3358541
TypeSmall organic molecule
Emp. Form.C50H71N17O8
Mol. Mass.1038.2078
SMILESCCCC[C@H](NC(=O)[C@H](Cc1c[nH]c2ccccc12)NC(=O)[C@H](CCCNC(N)=N)NC(=O)[C@@H](Cc1ccccc1)NC(=O)[C@H](Cc1cnc[nH]1)NC(=O)[C@H](CCN=[N+]=[N-])NC(=O)[C@H](CCCC)NC(C)=O)C(N)=O