Reaction Details
TargetMelanocortin receptor 5
LigandBDBM50031493
Substrate/Competitorn/a
Meas. Tech.ChEMBL_1438568 (CHEMBL3386099)
EC50 5.0±n/a nM
Citation Testa, CScrima, MGrimaldi, MD'Ursi, AMDirain, MLLubin-Germain, NSingh, AHaskell-Luevano, CChorev, MRovero, PPapini, AM 1,4-disubstituted-[1,2,3]triazolyl-containing analogues of MT-II: design, synthesis, conformational analysis, and biological activity. J Med Chem57:9424-34 (2014) 
 
Melanocortin receptor 5
Name:Melanocortin receptor 5
Type:Enzyme
Mol. Mass.:36966.58
Organism:Mus musculus (Mouse)
Description:P41149
Residue:325
BDBM50031493
NameBDBM50031493
Synonyms:CHEMBL3358538
TypeSmall organic molecule
Emp. Form.C51H73N17O8
Mol. Mass.1052.2344
SMILESCCCC[C@H](NC(=O)[C@H](Cc1c[nH]c2ccccc12)NC(=O)[C@H](CCCNC(N)=N)NC(=O)[C@@H](Cc1ccccc1)NC(=O)[C@H](Cc1cnc[nH]1)NC(=O)[C@H](CCCN=[N+]=[N-])NC(=O)[C@H](CCCC)NC(C)=O)C(N)=O