Reaction Details
TargetMelanocortin receptor 4
LigandBDBM50031499
Substrate/Competitorn/a
Meas. Tech.ChEMBL_1438567 (CHEMBL3386098)
EC50 0.310000±n/a nM
Citation Testa, CScrima, MGrimaldi, MD'Ursi, AMDirain, MLLubin-Germain, NSingh, AHaskell-Luevano, CChorev, MRovero, PPapini, AM 1,4-disubstituted-[1,2,3]triazolyl-containing analogues of MT-II: design, synthesis, conformational analysis, and biological activity. J Med Chem57:9424-34 (2014) 
 
Melanocortin receptor 4
Name:Melanocortin receptor 4
Type:PROTEIN
Mol. Mass.:36964.43
Organism:Mus musculus
Description:ChEMBL_1498850
Residue:332
BDBM50031499
NameBDBM50031499
Synonyms:CHEMBL3358542
TypeSmall organic molecule
Emp. Form.C52H74N16O10
Mol. Mass.1083.2452
SMILESCC(C)C[C@H](NC(C)=O)C(=O)N[C@@H](CC(N)=O)C(=O)N[C@@H](Cc1cnc[nH]1)C(=O)N[C@H](Cc1ccccc1)C(=O)N[C@@H](CCCNC(N)=N)C(=O)N[C@@H](Cc1c[nH]c2ccccc12)C(=O)N[C@@H](CCCCNC(C)=O)C(N)=O