Reaction Details
TargetPotassium voltage-gated channel subfamily H member 2
LigandBDBM50031506
Substrate/Competitorn/a
Meas. Tech.ChEMBL_1438594 (CHEMBL3386699)
Ki 15000±n/a nM
Citation He, SHong, QLai, ZYang, DXTing, PCKuethe, JTCernak, TADykstra, KDSperbeck, DMWu, ZYu, YYang, GXJian, TLiu, JGuiadeen, DKrikorian, ADSonatore, LMWiltsie, JLiu, JGorski, JNChung, CCGibson, JTLisnock, JXiao, JWolff, MTong, SXMadeira, MKaranam, BVShen, DMBalkovec, JMPinto, SNargund, RPDeVita, RJ Discovery of a Potent and Selective DGAT1 Inhibitor with a Piperidinyl-oxy-cyclohexanecarboxylic Acid Moiety. ACS Med Chem Lett5:1082-7 (2014) 
 
Potassium voltage-gated channel subfamily H member 2
Name:Potassium voltage-gated channel subfamily H member 2
Type:Multi-pass membrane protein
Mol. Mass.:126672.65
Organism:Homo sapiens (Human)
Description:Q12809
Residue:1159
BDBM50031506
NameBDBM50031506
Synonyms:CHEMBL3342772
TypeSmall organic molecule
Emp. Form.C24H27ClN4O3
Mol. Mass.454.949
SMILESOC(=O)[C@@H]1CC[C@@H](CC1)OC1CCN(CC1)c1ccc(cn1)-c1nc2cc(Cl)ccc2[nH]1