Reaction Details
TargetMalate dehydrogenase, mitochondrial
LigandBDBM50031516
Substrate/Competitorn/a
Meas. Tech.ChEMBL_1440890 (CHEMBL3374593)
IC50>20000±n/a nM
Citation Naik, RWon, MBan, HSBhattarai, DXu, XEo, YHong, YSSingh, SChoi, YAhn, HCLee, K Synthesis and structure-activity relationship study of chemical probes as hypoxia induced factor-1a/malate dehydrogenase 2 inhibitors. J Med Chem57:9522-38 (2014) 
 
Malate dehydrogenase, mitochondrial
Name:Malate dehydrogenase, mitochondrial
Type:PROTEIN
Mol. Mass.:35512.45
Organism:Homo sapiens (Human)
Description:ChEMBL_1456625
Residue:338
BDBM50031516
NameBDBM50031516
Synonyms:CHEMBL3359143
TypeSmall organic molecule
Emp. Form.C34H33NO4
Mol. Mass.519.6301
SMILESO=C(COc1ccc(cc1)C12CC3CC(CC(C3)C1)C2)Nc1cccc(c1)C(=O)c1ccc(OCC#C)cc1