Reaction Details
Target2-amino-4-hydroxy-6-hydroxymethyldihydropteridine diphosphokinase
LigandBDBM50031532
Substrate/Competitorn/a
Meas. Tech.ChEMBL_1440909 (CHEMBL3375173)
Kd 7260±n/a nM
Citation Dennis, MLChhabra, SWang, ZCDebono, ADolezal, ONewman, JPitcher, NPRahmani, RCleary, BBarlow, NHattarki, MGraham, BPeat, TSBaell, JBSwarbrick, JD Structure-based design and development of functionalized Mercaptoguanine derivatives as inhibitors of the folate biosynthesis pathway enzyme 6-hydroxymethyl-7,8-dihydropterin pyrophosphokinase from Staphylococcus aureus. J Med Chem57:9612-26 (2014) 
 
2-amino-4-hydroxy-6-hydroxymethyldihydropteridine diphosphokinase
Name:2-amino-4-hydroxy-6-hydroxymethyldihydropteridine diphosphokinase
Type:PROTEIN
Mol. Mass.:18024.64
Organism:Staphylococcus aureus
Description:ChEMBL_109736
Residue:158
BDBM50031532
NameBDBM50031532
Synonyms:CHEMBL3359163
TypeSmall organic molecule
Emp. Form.C13H10F3N5OS
Mol. Mass.341.312
SMILESNc1nc2[nH]c(SCc3ccccc3C(F)(F)F)nc2c(=O)[nH]1