Reaction Details
TargetCarbonic anhydrase 1
LigandBDBM50031534
Substrate/Competitorn/a
Meas. Tech.ChEMBL_1440915 (CHEMBL3375179)
Ki 18±n/a nM
Citation Bozdag, MPinard, MCarta, FMasini, EScozzafava, AMcKenna, RSupuran, CT A class of 4-sulfamoylphenyl-¿-aminoalkyl ethers with effective carbonic anhydrase inhibitory action and antiglaucoma effects. J Med Chem57:9673-86 (2014) 
 
Carbonic anhydrase 1
Name:Carbonic anhydrase 1
Type:Enzyme
Mol. Mass.:28873.37
Organism:Homo sapiens (Human)
Description:P00915
Residue:261
BDBM50031534
NameBDBM50031534
Synonyms:CHEMBL3359174
TypeSmall organic molecule
Emp. Form.C29H23N3O8S2
Mol. Mass.605.638
SMILESNS(=O)(=O)c1ccc(OCCNC(=S)Nc2ccc(c(c2)C(O)=O)-c2c3ccc(O)cc3oc3cc(=O)ccc23)cc1