Reaction Details
TargetCarbonic anhydrase 2
LigandBDBM50031578
Substrate/Competitorn/a
Meas. Tech.ChEMBL_1440916 (CHEMBL3375180)
Ki 5.1±n/a nM
Citation Bozdag, MPinard, MCarta, FMasini, EScozzafava, AMcKenna, RSupuran, CT A class of 4-sulfamoylphenyl-¿-aminoalkyl ethers with effective carbonic anhydrase inhibitory action and antiglaucoma effects. J Med Chem57:9673-86 (2014) 
 
Carbonic anhydrase 2
Name:Carbonic anhydrase 2
Type:Enzyme
Mol. Mass.:29250.71
Organism:Homo sapiens (Human)
Description:P00918
Residue:260
BDBM50031578
NameBDBM50031578
Synonyms:CHEMBL3359165
TypeSmall organic molecule
Emp. Form.C14H22N2O5S
Mol. Mass.330.4
SMILESCC(C)(C)OC(=O)NCCCOc1ccc(cc1)S(N)(=O)=O