Reaction Details
TargetCarbonic anhydrase 9
LigandBDBM50031585
Substrate/Competitorn/a
Meas. Tech.ChEMBL_1440917 (CHEMBL3375181)
Ki 6.6±n/a nM
Citation Bozdag, MPinard, MCarta, FMasini, EScozzafava, AMcKenna, RSupuran, CT A class of 4-sulfamoylphenyl-¿-aminoalkyl ethers with effective carbonic anhydrase inhibitory action and antiglaucoma effects. J Med Chem57:9673-86 (2014) 
 
Carbonic anhydrase 9
Name:Carbonic anhydrase 9
Type:Enzyme
Mol. Mass.:49669.03
Organism:Homo sapiens (Human)
Description:Catalytic domain of human cloned isozyme was used in the assay
Residue:459
BDBM50031585
NameBDBM50031585
Synonyms:CHEMBL3359172
TypeSmall organic molecule
Emp. Form.C13H19F3N2O5S
Mol. Mass.372.361
SMILES[O-]C(=O)C(F)(F)F.NS(=O)(=O)c1ccc(OCCCCC[NH3+])cc1