Reaction Details
TargetCarbonic anhydrase 12
LigandBDBM50031589
Substrate/Competitorn/a
Meas. Tech.ChEMBL_1441643 (CHEMBL3377089)
Kd 330±n/a nM
Citation Dudutiene, VMatuliene, JSmirnov, ATimm, DDZubriene, ABaranauskiene, LMorkunaite, VSmirnoviene, JMichailoviene, VJuozapaitiene, VMickeviciute, AKazokaite, JBak?yte, SKasiliauskaite, AJachno, JRevuckiene, JKi?onaite, MPilipuityte, VIvanauskaite, EMilinaviciute, GSmirnovas, VPetrikaite, VKairys, VPetrauskas, VNorvai?as, PLinge, DGibie?a, PCapkauskaite, EZak?auskas, AKazlauskas, EManakova, EGra?ulis, SLadbury, JEMatulis, D Discovery and characterization of novel selective inhibitors of carbonic anhydrase IX. J Med Chem57:9435-46 (2014) 
 
Carbonic anhydrase 12
Name:Carbonic anhydrase 12
Type:Enzyme
Mol. Mass.:39456.00
Organism:Homo sapiens (Human)
Description:Catalytic domain of human cloned isozyme was used in the assay
Residue:354
BDBM50031589
NameBDBM50031589
Synonyms:CHEMBL3359179
TypeSmall organic molecule
Emp. Form.C16H23F3N2O3S2
Mol. Mass.412.491
SMILESNS(=O)(=O)c1c(F)c(F)c(SCCO)c(F)c1NC1CCCCCCC1