Reaction Details
TargetCarbonic anhydrase 13
LigandBDBM50031589
Substrate/Competitorn/a
Meas. Tech.ChEMBL_1441645 (CHEMBL3377091)
Kd 140±n/a nM
Citation Dudutiene, VMatuliene, JSmirnov, ATimm, DDZubriene, ABaranauskiene, LMorkunaite, VSmirnoviene, JMichailoviene, VJuozapaitiene, VMickeviciute, AKazokaite, JBak?yte, SKasiliauskaite, AJachno, JRevuckiene, JKi?onaite, MPilipuityte, VIvanauskaite, EMilinaviciute, GSmirnovas, VPetrikaite, VKairys, VPetrauskas, VNorvai?as, PLinge, DGibie?a, PCapkauskaite, EZak?auskas, AKazlauskas, EManakova, EGra?ulis, SLadbury, JEMatulis, D Discovery and characterization of novel selective inhibitors of carbonic anhydrase IX. J Med Chem57:9435-46 (2014) 
 
Carbonic anhydrase 13
Name:Carbonic anhydrase 13
Type:Enzyme
Mol. Mass.:29445.78
Organism:Homo sapiens (Human)
Description:Q8N1Q1
Residue:262
BDBM50031589
NameBDBM50031589
Synonyms:CHEMBL3359179
TypeSmall organic molecule
Emp. Form.C16H23F3N2O3S2
Mol. Mass.412.491
SMILESNS(=O)(=O)c1c(F)c(F)c(SCCO)c(F)c1NC1CCCCCCC1