Reaction Details
TargetPeptidase 1
LigandBDBM50031687
Substrate/Competitorn/a
Meas. Tech.ChEMBL_1443313 (CHEMBL3374743)
IC50 4.0±n/a nM
Citation Newton, GKPerrior, TRJenkins, KMajor, MRKey, REStewart, MRFirth-Clark, SLloyd, SMZhang, JFrancis-Newton, NJRichardson, JPChen, JLai, PGarrod, DRRobinson, C The discovery of potent, selective, and reversible inhibitors of the house dust mite peptidase allergen Der p 1: an innovative approach to the treatment of allergic asthma. J Med Chem57:9447-62 (2014) 
 
Peptidase 1
Name:Peptidase 1
Type:Enzyme
Mol. Mass.:36101.04
Organism:Dermatophagoides pteronyssinus (European house dust mite)
Description:P08176
Residue:320
BDBM50031687
NameBDBM50031687
Synonyms:CHEMBL3360300
TypeSmall organic molecule
Emp. Form.C32H41N5O6
Mol. Mass.591.6978
SMILESCNC(=O)c1ccc(CNC(=O)C(=O)[C@@H](NC(=O)[C@H](C)NC(=O)[C@@H](N2Cc3ccccc3C2=O)C(C)(C)C)C(C)C)cc1