Reaction Details
TargetPeptidase 1
LigandBDBM50031716
Substrate/Competitorn/a
Meas. Tech.ChEMBL_1443313 (CHEMBL3374743)
IC50 115±n/a nM
Citation Newton, GKPerrior, TRJenkins, KMajor, MRKey, REStewart, MRFirth-Clark, SLloyd, SMZhang, JFrancis-Newton, NJRichardson, JPChen, JLai, PGarrod, DRRobinson, C The discovery of potent, selective, and reversible inhibitors of the house dust mite peptidase allergen Der p 1: an innovative approach to the treatment of allergic asthma. J Med Chem57:9447-62 (2014) 
 
Peptidase 1
Name:Peptidase 1
Type:Enzyme
Mol. Mass.:36101.04
Organism:Dermatophagoides pteronyssinus (European house dust mite)
Description:P08176
Residue:320
BDBM50031716
NameBDBM50031716
Synonyms:CHEMBL3359788
TypeSmall organic molecule
Emp. Form.C31H41N5O5
Mol. Mass.563.6877
SMILESCC(C)[C@H](NC(=O)[C@H](C)NC(=O)[C@H](Cc1ccccc1)NC(=O)c1ccccc1)C(=O)C(=O)NC1CCN(C)CC1