Reaction Details
TargetHeat shock protein HSP 90-alpha
LigandBDBM50031734
Substrate/Competitorn/a
Meas. Tech.ChEMBL_1432555 (CHEMBL3387537)
IC50 12±n/a nM
Citation McBride, CMLevine, BXia, YBellamacina, CMachajewski, TGao, ZRenhowe, PAntonios-McCrea, WBarsanti, PBrinner, KCostales, ADoughan, BLin, XLouie, AMcKenna, MMendenhall, KPoon, DRico, AWang, MWilliams, TEAbrams, TFong, SHendrickson, TLei, DLin, JMenezes, DPryer, NTaverna, PXu, YZhou, YShafer, CM Design, structure-activity relationship, and in vivo characterization of the development candidate NVP-HSP990. J Med Chem57:9124-9 (2014) 
 
Heat shock protein HSP 90-alpha
Name:Heat shock protein HSP 90-alpha
Type:Molecular Chaperone
Mol. Mass.:84623.45
Organism:Homo sapiens (Human)
Description:P07900
Residue:732
BDBM50031734
NameBDBM50031734
Synonyms:CHEMBL3360306
TypeSmall organic molecule
Emp. Form.C21H21N5O2
Mol. Mass.375.4237
SMILESCOc1cccc(n1)-c1cc(C)ccc1[C@H]1Cc2nc(N)nc(C)c2C(=O)N1