Reaction Details
TargetTyrosine-protein kinase JAK2
LigandBDBM50031738
Substrate/Competitorn/a
Meas. Tech.ChEMBL_1433466 (CHEMBL3382736)
IC50>30000±n/a nM
Citation Menet, CJFletcher, SRVan Lommen, GGeney, RBlanc, JSmits, KJouannigot, NDeprez, Pvan der Aar, EMClement-Lacroix, PLepescheux, LGalien, RVayssiere, BNelles, LChristophe, TBrys, RUhring, MCiesielski, FVan Rompaey, L Triazolopyridines as selective JAK1 inhibitors: from hit identification to GLPG0634. J Med Chem57:9323-42 (2014) 
 
Tyrosine-protein kinase JAK2
Name:Tyrosine-protein kinase JAK2
Type:Protein
Mol. Mass.:130684.68
Organism:Homo sapiens (Human)
Description:O60674
Residue:1132
BDBM50031738
NameBDBM50031738
Synonyms:CHEMBL3360355
TypeSmall organic molecule
Emp. Form.C19H16F3N5O2
Mol. Mass.403.3578
SMILESFC(F)(F)C(=O)NCc1ccc(cc1)-c1cccc2nc(NC(=O)C3CC3)nn12