Reaction Details
TargetCytochrome P450 2C19
LigandBDBM103727
Substrate/Competitorn/a
Meas. Tech.ChEMBL_1433484 (CHEMBL3382754)
IC50>70000±n/a nM
Citation Menet, CJFletcher, SRVan Lommen, GGeney, RBlanc, JSmits, KJouannigot, NDeprez, Pvan der Aar, EMClement-Lacroix, PLepescheux, LGalien, RVayssiere, BNelles, LChristophe, TBrys, RUhring, MCiesielski, FVan Rompaey, L Triazolopyridines as selective JAK1 inhibitors: from hit identification to GLPG0634. J Med Chem57:9323-42 (2014) 
 
Cytochrome P450 2C19
Name:Cytochrome P450 2C19
Type:Enzyme
Mol. Mass.:55935.47
Organism:Homo sapiens (Human)
Description:P33261
Residue:490
BDBM103727
NameBDBM103727
Synonyms:US10112907, Example 00033 US10708263, Compound 1 US10919890, Compound 1 US11000528, Cpd # 1 US11279699, Compound Filgotinib | US8563545, 1
TypeSmall organic molecule
Emp. Form.C21H23N5O3S
Mol. Mass.425.504
SMILESO=C(Nc1nc2cccc(-c3ccc(CN4CCS(=O)(=O)CC4)cc3)n2n1)C1CC1